Cut sets,BE1,BE2,BE3,BE4,BE5,BE6,BE7,BE8,T,N
0,0,0,0,0,0,0,0,0,0,1
1,0,0,0,0,0,0,0,1,0,1
2,0,0,0,0,0,0,1,0,0,1
3,0,0,0,0,0,0,1,1,0,1
4,0,0,0,0,0,1,0,0,0,1
5,0,0,0,0,0,1,0,1,0,1
6,0,0,0,0,0,1,1,0,0,1
7,0,0,0,0,0,1,1,1,0,1
8,0,0,0,0,1,0,0,0,0,1
9,0,0,0,0,1,0,0,1,0,1
10,0,0,0,0,1,0,1,0,0,1
11,0,0,0,0,1,0,1,1,0,1
12,0,0,0,0,1,1,0,0,0,1
13,0,0,0,0,1,1,0,1,0,1
14,0,0,0,0,1,1,1,0,0,1
15,0,0,0,0,1,1,1,1,0,1
16,0,0,0,1,0,0,0,0,0,1
17,0,0,0,1,0,0,0,1,0,1
18,0,0,0,1,0,0,1,0,0,1
19,0,0,0,1,0,0,1,1,0,1
20,0,0,0,1,0,1,0,0,0,1
21,0,0,0,1,0,1,0,1,0,1
22,0,0,0,1,0,1,1,0,0,1
23,0,0,0,1,0,1,1,1,0,1
24,0,0,0,1,1,0,0,0,0,1
25,0,0,0,1,1,0,0,1,0,1
26,0,0,0,1,1,0,1,0,0,1
27,0,0,0,1,1,0,1,1,0,1
28,0,0,0,1,1,1,0,0,0,1
29,0,0,0,1,1,1,0,1,0,1
30,0,0,0,1,1,1,1,0,0,1
31,0,0,0,1,1,1,1,1,0,1
32,0,0,1,0,0,0,0,0,0,1
33,0,0,1,0,0,0,0,1,0,1
34,0,0,1,0,0,0,1,0,0,1
35,0,0,1,0,0,0,1,1,0,1
36,0,0,1,0,0,1,0,0,0,1
37,0,0,1,0,0,1,0,1,0,1
38,0,0,1,0,0,1,1,0,0,1
39,0,0,1,0,0,1,1,1,0,1
40,0,0,1,0,1,0,0,0,0,1
41,0,0,1,0,1,0,0,1,0,1
42,0,0,1,0,1,0,1,0,0,1
43,0,0,1,0,1,0,1,1,0,1
44,0,0,1,0,1,1,0,0,0,1
45,0,0,1,0,1,1,0,1,0,1
46,0,0,1,0,1,1,1,0,0,1
47,0,0,1,0,1,1,1,1,0,1
48,0,0,1,1,0,0,0,0,0,1
49,0,0,1,1,0,0,0,1,0,1
50,0,0,1,1,0,0,1,0,0,1
51,0,0,1,1,0,0,1,1,0,1
52,0,0,1,1,0,1,0,0,0,1
53,0,0,1,1,0,1,0,1,0,1
54,0,0,1,1,0,1,1,0,0,1
55,0,0,1,1,0,1,1,1,0,1
56,0,0,1,1,1,0,0,0,0,1
57,0,0,1,1,1,0,0,1,0,1
58,0,0,1,1,1,0,1,0,0,1
59,0,0,1,1,1,0,1,1,0,1
60,0,0,1,1,1,1,0,0,0,1
61,0,0,1,1,1,1,0,1,0,1
62,0,0,1,1,1,1,1,0,0,1
63,0,0,1,1,1,1,1,1,0,1
64,0,1,0,0,0,0,0,0,0,1
65,0,1,0,0,0,0,0,1,0,1
66,0,1,0,0,0,0,1,0,0,1
67,0,1,0,0,0,0,1,1,0,1
68,0,1,0,0,0,1,0,0,0,1
69,0,1,0,0,0,1,0,1,0,1
70,0,1,0,0,0,1,1,0,0,1
71,0,1,0,0,0,1,1,1,0,1
72,0,1,0,0,1,0,0,0,0,1
73,0,1,0,0,1,0,0,1,0,1
74,0,1,0,0,1,0,1,0,0,1
75,0,1,0,0,1,0,1,1,0,1
76,0,1,0,0,1,1,0,0,0,1
77,0,1,0,0,1,1,0,1,0,1
78,0,1,0,0,1,1,1,0,0,1
79,0,1,0,0,1,1,1,1,0,1
80,0,1,0,1,0,0,0,0,0,1
81,0,1,0,1,0,0,0,1,0,1
82,0,1,0,1,0,0,1,0,0,1
83,0,1,0,1,0,0,1,1,0,1
84,0,1,0,1,0,1,0,0,0,1
85,0,1,0,1,0,1,0,1,0,1
86,0,1,0,1,0,1,1,0,0,1
87,0,1,0,1,0,1,1,1,0,1
88,0,1,0,1,1,0,0,0,0,1
89,0,1,0,1,1,0,0,1,0,1
90,0,1,0,1,1,0,1,0,0,1
91,0,1,0,1,1,0,1,1,0,1
92,0,1,0,1,1,1,0,0,0,1
93,0,1,0,1,1,1,0,1,0,1
94,0,1,0,1,1,1,1,0,0,1
95,0,1,0,1,1,1,1,1,0,1
96,0,1,1,0,0,0,0,0,0,1
97,0,1,1,0,0,0,0,1,0,1
98,0,1,1,0,0,0,1,0,0,1
99,0,1,1,0,0,0,1,1,0,1
100,0,1,1,0,0,1,0,0,0,1
101,0,1,1,0,0,1,0,1,0,1
102,0,1,1,0,0,1,1,0,0,1
103,0,1,1,0,0,1,1,1,0,1
104,0,1,1,0,1,0,0,0,0,1
105,0,1,1,0,1,0,0,1,0,1
106,0,1,1,0,1,0,1,0,0,1
107,0,1,1,0,1,0,1,1,0,1
108,0,1,1,0,1,1,0,0,0,1
109,0,1,1,0,1,1,0,1,0,1
110,0,1,1,0,1,1,1,0,0,1
111,0,1,1,0,1,1,1,1,0,1
112,0,1,1,1,0,0,0,0,0,1
113,0,1,1,1,0,0,0,1,0,1
114,0,1,1,1,0,0,1,0,0,1
115,0,1,1,1,0,0,1,1,0,1
116,0,1,1,1,0,1,0,0,0,1
117,0,1,1,1,0,1,0,1,0,1
118,0,1,1,1,0,1,1,0,0,1
119,0,1,1,1,0,1,1,1,1,1
120,0,1,1,1,1,0,0,0,1,1
121,0,1,1,1,1,0,0,1,1,1
122,0,1,1,1,1,0,1,0,1,1
123,0,1,1,1,1,0,1,1,1,1
124,0,1,1,1,1,1,0,0,1,1
125,0,1,1,1,1,1,0,1,1,1
126,0,1,1,1,1,1,1,0,1,1
127,0,1,1,1,1,1,1,1,1,1
128,1,0,0,0,0,0,0,0,0,1
129,1,0,0,0,0,0,0,1,0,1
130,1,0,0,0,0,0,1,0,0,1
131,1,0,0,0,0,0,1,1,0,1
132,1,0,0,0,0,1,0,0,0,1
133,1,0,0,0,0,1,0,1,0,1
134,1,0,0,0,0,1,1,0,0,1
135,1,0,0,0,0,1,1,1,0,1
136,1,0,0,0,1,0,0,0,0,1
137,1,0,0,0,1,0,0,1,0,1
138,1,0,0,0,1,0,1,0,0,1
139,1,0,0,0,1,0,1,1,0,1
140,1,0,0,0,1,1,0,0,0,1
141,1,0,0,0,1,1,0,1,0,1
142,1,0,0,0,1,1,1,0,0,1
143,1,0,0,0,1,1,1,1,0,1
144,1,0,0,1,0,0,0,0,0,1
145,1,0,0,1,0,0,0,1,0,1
146,1,0,0,1,0,0,1,0,0,1
147,1,0,0,1,0,0,1,1,0,1
148,1,0,0,1,0,1,0,0,0,1
149,1,0,0,1,0,1,0,1,0,1
150,1,0,0,1,0,1,1,0,0,1
151,1,0,0,1,0,1,1,1,0,1
152,1,0,0,1,1,0,0,0,0,1
153,1,0,0,1,1,0,0,1,0,1
154,1,0,0,1,1,0,1,0,0,1
155,1,0,0,1,1,0,1,1,0,1
156,1,0,0,1,1,1,0,0,0,1
157,1,0,0,1,1,1,0,1,0,1
158,1,0,0,1,1,1,1,0,0,1
159,1,0,0,1,1,1,1,1,0,1
160,1,0,1,0,0,0,0,0,0,1
161,1,0,1,0,0,0,0,1,0,1
162,1,0,1,0,0,0,1,0,0,1
163,1,0,1,0,0,0,1,1,0,1
164,1,0,1,0,0,1,0,0,0,1
165,1,0,1,0,0,1,0,1,0,1
166,1,0,1,0,0,1,1,0,0,1
167,1,0,1,0,0,1,1,1,0,1
168,1,0,1,0,1,0,0,0,0,1
169,1,0,1,0,1,0,0,1,0,1
170,1,0,1,0,1,0,1,0,0,1
171,1,0,1,0,1,0,1,1,0,1
172,1,0,1,0,1,1,0,0,0,1
173,1,0,1,0,1,1,0,1,0,1
174,1,0,1,0,1,1,1,0,0,1
175,1,0,1,0,1,1,1,1,0,1
176,1,0,1,1,0,0,0,0,0,1
177,1,0,1,1,0,0,0,1,0,1
178,1,0,1,1,0,0,1,0,0,1
179,1,0,1,1,0,0,1,1,0,1
180,1,0,1,1,0,1,0,0,0,1
181,1,0,1,1,0,1,0,1,0,1
182,1,0,1,1,0,1,1,0,0,1
183,1,0,1,1,0,1,1,1,1,1
184,1,0,1,1,1,0,0,0,1,1
185,1,0,1,1,1,0,0,1,1,1
186,1,0,1,1,1,0,1,0,1,1
187,1,0,1,1,1,0,1,1,1,1
188,1,0,1,1,1,1,0,0,1,1
189,1,0,1,1,1,1,0,1,1,1
190,1,0,1,1,1,1,1,0,1,1
191,1,0,1,1,1,1,1,1,1,1
192,1,1,0,0,0,0,0,0,0,1
193,1,1,0,0,0,0,0,1,0,1
194,1,1,0,0,0,0,1,0,0,1
195,1,1,0,0,0,0,1,1,0,1
196,1,1,0,0,0,1,0,0,0,1
197,1,1,0,0,0,1,0,1,0,1
198,1,1,0,0,0,1,1,0,0,1
199,1,1,0,0,0,1,1,1,1,1
200,1,1,0,0,1,0,0,0,1,1
201,1,1,0,0,1,0,0,1,1,1
202,1,1,0,0,1,0,1,0,1,1
203,1,1,0,0,1,0,1,1,1,1
204,1,1,0,0,1,1,0,0,1,1
205,1,1,0,0,1,1,0,1,1,1
206,1,1,0,0,1,1,1,0,1,1
207,1,1,0,0,1,1,1,1,1,1
208,1,1,0,1,0,0,0,0,0,1
209,1,1,0,1,0,0,0,1,0,1
210,1,1,0,1,0,0,1,0,0,1
211,1,1,0,1,0,0,1,1,0,1
212,1,1,0,1,0,1,0,0,0,1
213,1,1,0,1,0,1,0,1,0,1
214,1,1,0,1,0,1,1,0,0,1
215,1,1,0,1,0,1,1,1,1,1
216,1,1,0,1,1,0,0,0,1,1
217,1,1,0,1,1,0,0,1,1,1
218,1,1,0,1,1,0,1,0,1,1
219,1,1,0,1,1,0,1,1,1,1
220,1,1,0,1,1,1,0,0,1,1
221,1,1,0,1,1,1,0,1,1,1
222,1,1,0,1,1,1,1,0,1,1
223,1,1,0,1,1,1,1,1,1,1
224,1,1,1,0,0,0,0,0,0,1
225,1,1,1,0,0,0,0,1,0,1
226,1,1,1,0,0,0,1,0,0,1
227,1,1,1,0,0,0,1,1,0,1
228,1,1,1,0,0,1,0,0,0,1
229,1,1,1,0,0,1,0,1,0,1
230,1,1,1,0,0,1,1,0,0,1
231,1,1,1,0,0,1,1,1,1,1
232,1,1,1,0,1,0,0,0,1,1
233,1,1,1,0,1,0,0,1,1,1
234,1,1,1,0,1,0,1,0,1,1
235,1,1,1,0,1,0,1,1,1,1
236,1,1,1,0,1,1,0,0,1,1
237,1,1,1,0,1,1,0,1,1,1
238,1,1,1,0,1,1,1,0,1,1
239,1,1,1,0,1,1,1,1,1,1
240,1,1,1,1,0,0,0,0,0,1
241,1,1,1,1,0,0,0,1,0,1
242,1,1,1,1,0,0,1,0,0,1
243,1,1,1,1,0,0,1,1,0,1
244,1,1,1,1,0,1,0,0,0,1
245,1,1,1,1,0,1,0,1,0,1
246,1,1,1,1,0,1,1,0,0,1
247,1,1,1,1,0,1,1,1,1,1
248,1,1,1,1,1,0,0,0,1,1
249,1,1,1,1,1,0,0,1,1,1
250,1,1,1,1,1,0,1,0,1,1
251,1,1,1,1,1,0,1,1,1,1
252,1,1,1,1,1,1,0,0,1,1
253,1,1,1,1,1,1,0,1,1,1
254,1,1,1,1,1,1,1,0,1,1
255,1,1,1,1,1,1,1,1,1,1
